{"text_format":"1","workbook":"xlsx","n_sheets":8,"sheets":["ANA GİRİŞ","DATA","İCMAL","SIRALAMA","KURA","EK-16","EK-17","BOŞ LİSTE"],"not_rendered":{"charts":0,"images":16,"macros":1,"external_links":0,"defined_names":11,"comments":0,"pivot_tables":0},"unopened":[],"bounds":{"document_bytes":16777216,"sheet_cells":100000,"rows_first":2000,"rows_last":500,"rows_between":2000,"halvings":0,"cell_chars":16384,"cell_head_chars":4096},"cells_cut":0,"cells_raw":0,"read":"whole","date_system":"1900"}

{"sheet":"ANA GİRİŞ","index":0,"n_rows":0,"n_cols":0,"rows_kept":0,"cut":false,"hidden":false,"merged":[[0,0,2,1],[6,6,23,16],[0,16,2,17]]}

{"sheet":"DATA","index":1,"n_rows":22,"n_cols":10,"rows_kept":22,"cut":false,"hidden":false,"merged":[[3,0,3,1],[0,0,0,8],[2,3,2,4],[1,5,1,7],[1,3,1,4],[2,5,2,7],[1,0,1,1],[2,0,2,1],[1,8,2,9],[4,9,5,9],[4,0,5,0],[4,1,5,1],[4,2,5,2],[4,3,4,4]]}
["\"GENÇ BİLÂLLER\" EZAN OKUMA YARIŞMASI JURİ DEĞERLENDİRME PROGRAMI"]
["YARIŞMA ADI",null,"2023 \"GENÇ BİLÂLLER\" EZAN OKUMA YARIŞMASI","YARIŞMAYI DÜZENLEYEN",null,"Din Öğretimi Genel Müdürlüğü",null,null,"AŞAĞIDAKİ BÖLÜME YARIŞMANIN TÜRÜNE GÖRE DEĞERLENDİRME KRİTERLERİNİ VE MAKSİMUM PUANLARINI GİRİNİZ."]
["YARIŞMA BÖLGESİ",null,"7. BÖLGE","TABAN PUAN",null,30]
["MAKAM",null,3,"SES ve SEDA",20,"DİKSİYON VE TECVİT",20]
["KURA SONUCU","Öğrencinin Adı Soyadı","İl/İlçe/Okul","JURİ BAŞKANI",null,"ÜYE -1","ÜYE -2","ÜYE -3","ÜYE -4","GÖREVLİ ÖĞRETMEN"]
[null,null,null,"ADI SOYADI","ÜNVANI","ADI SOYADI","ADI SOYADI","ADI SOYADI","ADI SOYADI"]
[1,"KAMİL YEŞİL","KONYA ANADOLU İMAM HATİP LİSESİ","YUSUF ARIKAN","İl Müftü Yardımcısı","ALİ ÖGE","MUSTAFA YILDIRIM","MEHMET CABA","ÜNVER GÜNGÖR","MUSTAFA EKİNCİ"]
[7,"RAMAZAN KAYMAK","AKŞEHİR ANADOLU İMAM HATİP LİSESİ","YUSUF ARIKAN","İl Müftü Yardımcısı","ALİ ÖGE","MUSTAFA YILDIRIM",{"$f":"H7","v":"MEHMET CABA"},{"$f":"I7","v":"ÜNVER GÜNGÖR"},"MEHMET AKİF EKİNCİ"]
[6,"İBRAHİM KARAYER","ALTINEKİN ANADOLU İMAM HATİP LİSESİ","YUSUF ARIKAN","İl Müftü Yardımcısı","ALİ ÖGE","MUSTAFA YILDIRIM",{"$f":"H8","v":"MEHMET CABA"},{"$f":"I8","v":"ÜNVER GÜNGÖR"},"ZEYNEP ARSLANTALAY"]
[5,"MUHAMMET DİLEK","KARAPINAR ANADOLU İMAM HATİP LİSESİ","YUSUF ARIKAN","İl Müftü Yardımcısı","ALİ ÖGE","MUSTAFA YILDIRIM","MEHMET CABA","ÜNVER GÜNGÖR","MUSTAFA SARIBAŞ"]
[4,"MEHMET AKİF KABUKÇU","AFYONKARAHİSAR ANADOLU İMAM HATİP LİSESİ","YUSUF ARIKAN","İl Müftü Yardımcısı","ALİ ÖGE","MUSTAFA YILDIRIM","MEHMET CABA","ÜNVER GÜNGÖR","EROL ADA"]
[3,"ONUR ÜNLÜ","ANTALYA ANADOLU İMAM HATİP LİSESİ","YUSUF ARIKAN","İl Müftü Yardımcısı","ALİ ÖGE","MUSTAFA YILDIRIM","MEHMET CABA","ÜNVER GÜNGÖR","İBRAHİM AKTAN"]
[2,"ALİ CESUR","TEFENNİ ANADOLU İMAM HATİP LİSESİ","YUSUF ARIKAN","İl Müftü Yardımcısı","ALİ ÖGE","MUSTAFA YILDIRIM","MEHMET CABA","ÜNVER GÜNGÖR","MEHMET BÖYÜK"]
[8,"KADİR ÜNLÜSOY","ATABEY MEHMET YILDIZLI ANADOLU İMAM HATİP LİSESİ","YUSUF ARIKAN","İl Müftü Yardımcısı","ALİ ÖGE","MUSTAFA YILDIRIM","MEHMET CABA","ÜNVER GÜNGÖR","HÜSEYİN YÜREKLİ"]
[9,"MUHAMMET ERKAL","KARAMAN ANADOLU İMAM HATİP LİSESİ","YUSUF ARIKAN","İl Müftü Yardımcısı","ALİ ÖGE","MUSTAFA YILDIRIM","MEHMET CABA","ÜNVER GÜNGÖR","HASAN ERKAN"]
[10,"ONUR YÜCESAN","MUCUR ANADOLU İMAM HATİP LİSESİ","YUSUF ARIKAN","İl Müftü Yardımcısı","ALİ ÖGE","MUSTAFA YILDIRIM","MEHMET CABA","ÜNVER GÜNGÖR","AHMET ÖZKAYA"]
[11]
[12]
[13]
[14]
[15]
[16]

{"sheet":"İCMAL","index":2,"n_rows":31,"n_cols":11,"rows_kept":31,"cut":false,"hidden":false,"merged":[[1,0,2,9],[26,0,26,1],[0,0,0,2],[30,4,30,7],[25,0,25,1],[25,3,25,4],[28,0,28,1],[28,3,28,4],[25,5,25,6],[28,5,28,6],[28,7,28,9],[25,7,25,9],[29,0,29,1],[29,3,29,4],[29,5,29,6]]}
[{"$f":"DATA!C3","v":"7. BÖLGE"}]
[{"$f":"DATA!F2&\" \"&DATA!C2 & \" DEĞERLENDİRME FORMU\"","v":"Din Öğretimi Genel Müdürlüğü 2023 \"GENÇ BİLÂLLER\" EZAN OKUMA YARIŞMASI DEĞERLENDİRME FORMU"}]
[]
["S.N.","Öğrencinin Adı Soyadı","İl/İlçe/Okul",{"$f":"DATA!D7","v":"YUSUF ARIKAN"},{"$f":"DATA!F7","v":"ALİ ÖGE"},{"$f":"DATA!G7","v":"MUSTAFA YILDIRIM"},{"$f":"DATA!H7","v":"MEHMET CABA"},{"$f":"DATA!I7","v":"ÜNVER GÜNGÖR"},"Aritmetik Ortalaması ","Sıralama"]
[1,{"$f":"VLOOKUP(A5,DATA!A$7:I21,2,FALSE)","v":"KAMİL YEŞİL"},{"$f":"VLOOKUP(A5,DATA!A$7:I21,3,FALSE)","v":"KONYA ANADOLU İMAM HATİP LİSESİ"},1,1,1,1,1,{"$f":"SUM(D5:H5)/(SUBTOTAL(3,D5:H5))","v":1},{"$f":"IF(I5=\"\",\"\",(RANK(I5,I$5:I$23)))","v":10},{"$f":"SUM(D5:H5)","v":5}]
[2,{"$f":"VLOOKUP(A6,DATA!A$7:I22,2,FALSE)","v":"ALİ CESUR"},{"$f":"VLOOKUP(A6,DATA!A$7:I22,3,FALSE)","v":"TEFENNİ ANADOLU İMAM HATİP LİSESİ"},5,5,5,5,5,{"$f":"SUM(D6:H6)/(SUBTOTAL(3,D6:H6))","v":5},9,{"$f":"SUM(D6:H6)","v":25}]
[3,{"$f":"VLOOKUP(A7,DATA!A$7:I23,2,FALSE)","v":"ONUR ÜNLÜ"},{"$f":"VLOOKUP(A7,DATA!A$7:I23,3,FALSE)","v":"ANTALYA ANADOLU İMAM HATİP LİSESİ"},10,10,10,10,10,10,8,50]
[4,{"$f":"VLOOKUP(A8,DATA!A$7:I24,2,FALSE)","v":"MEHMET AKİF KABUKÇU"},{"$f":"VLOOKUP(A8,DATA!A$7:I24,3,FALSE)","v":"AFYONKARAHİSAR ANADOLU İMAM HATİP LİSESİ"},15,15,15,15,15,15,7,75]
[5,{"$f":"VLOOKUP(A9,DATA!A$7:I25,2,FALSE)","v":"MUHAMMET DİLEK"},{"$f":"VLOOKUP(A9,DATA!A$7:I25,3,FALSE)","v":"KARAPINAR ANADOLU İMAM HATİP LİSESİ"},20,20,20,20,20,20,6,100]
[6,{"$f":"VLOOKUP(A10,DATA!A$7:I26,2,FALSE)","v":"İBRAHİM KARAYER"},{"$f":"VLOOKUP(A10,DATA!A$7:I26,3,FALSE)","v":"ALTINEKİN ANADOLU İMAM HATİP LİSESİ"},25,25,25,25,25,25,5,125]
[7,{"$f":"VLOOKUP(A11,DATA!A$7:I27,2,FALSE)","v":"RAMAZAN KAYMAK"},{"$f":"VLOOKUP(A11,DATA!A$7:I27,3,FALSE)","v":"AKŞEHİR ANADOLU İMAM HATİP LİSESİ"},30,30,30,30,30,30,4,150]
[8,{"$f":"VLOOKUP(A12,DATA!A$7:I28,2,FALSE)","v":"KADİR ÜNLÜSOY"},{"$f":"VLOOKUP(A12,DATA!A$7:I28,3,FALSE)","v":"ATABEY MEHMET YILDIZLI ANADOLU İMAM HATİP LİSESİ"},35,35,35,35,35,35,3,175]
[9,{"$f":"VLOOKUP(A13,DATA!A$7:I29,2,FALSE)","v":"MUHAMMET ERKAL"},{"$f":"VLOOKUP(A13,DATA!A$7:I29,3,FALSE)","v":"KARAMAN ANADOLU İMAM HATİP LİSESİ"},55,55,55,55,55,55,2,275]
[10,{"$f":"VLOOKUP(A14,DATA!A$7:I30,2,FALSE)","v":"ONUR YÜCESAN"},{"$f":"VLOOKUP(A14,DATA!A$7:I30,3,FALSE)","v":"MUCUR ANADOLU İMAM HATİP LİSESİ"},25,52,456,145,156,166.8,1,834]
[11]
[12]
[13]
[14]
[15]
[16]
[17]
[18]
[19,null,null,null,null,null,null,null,null,null,0]
[null,null,null,null,null,null,null,null,null,null,0]
[null,null,null,null,null,null,null,null,null,null,0]
["KOMİSYON BAŞKANI",null,"ÜYE-1","ÜYE-2",null,"ÜYE-3",null,"ÜYE-4",null,null,0]
[{"$f":"TODAY()","v":"2023-04-19"},null,null,null,null,null,null,null,null,null,0]
[null,null,null,null,null,null,null,null,null,null,0]
[{"$f":"DATA!D7","v":"YUSUF ARIKAN"},null,{"$f":"DATA!F7","v":"ALİ ÖGE"},{"$f":"DATA!G7","v":"MUSTAFA YILDIRIM"},null,{"$f":"DATA!H7","v":"MEHMET CABA"},null,{"$f":"DATA!I7","v":"ÜNVER GÜNGÖR"},null,null,0]
[{"$f":"DATA!E7","v":"İl Müftü Yardımcısı"},null,"Seçici Kurul Üyesi","Seçici Kurul Üyesi",null,"Seçici Kurul Üyesi",null,null,"Seçici Kurul Üyesi",null,0]
[null,null,null,null,null,null,null,null,null,null,0]

{"sheet":"SIRALAMA","index":3,"n_rows":43,"n_cols":23,"rows_kept":43,"cut":false,"hidden":false,"merged":[[0,0,0,2],[32,0,32,1],[32,3,32,4],[32,6,32,7],[1,0,2,9],[25,0,25,1],[26,0,26,1],[30,4,30,7],[28,0,28,1],[28,3,28,4],[28,5,28,6],[28,7,28,9],[29,0,29,1],[29,3,29,4],[29,5,29,6]]}
[{"$f":"DATA!C3","v":"7. BÖLGE"}]
[{"$f":"DATA!F2&\" \"&DATA!C2 & \" DEĞERLENDİRME FORMU\"","v":"Din Öğretimi Genel Müdürlüğü 2023 \"GENÇ BİLÂLLER\" EZAN OKUMA YARIŞMASI DEĞERLENDİRME FORMU"}]
[]
["S.N.","Öğrencinin Adı Soyadı","İl/İlçe/Okul","Başkan ","1. Üye ","2. Üye ","3. Üye","4. Üye","Aritmetik Ortalaması ","Sıralama"]
[1,"ONUR YÜCESAN","MUCUR ANADOLU İMAM HATİP LİSESİ",25,52,456,145,156,166.8,1,{"$error":"#DIV/0!"}]
[2,"MUHAMMET ERKAL","KARAMAN ANADOLU İMAM HATİP LİSESİ",55,55,55,55,55,55,2,{"$error":"#DIV/0!"}]
[3,"KADİR ÜNLÜSOY","ATABEY MEHMET YILDIZLI ANADOLU İMAM HATİP LİSESİ",35,35,35,35,35,35,3,{"$error":"#DIV/0!"}]
[4,"RAMAZAN KAYMAK","AKŞEHİR ANADOLU İMAM HATİP LİSESİ",30,30,30,30,30,30,4,{"$error":"#DIV/0!"}]
[5,"İBRAHİM KARAYER","ALTINEKİN ANADOLU İMAM HATİP LİSESİ",25,25,25,25,25,25,5,{"$error":"#DIV/0!"}]
[6,"MUHAMMET DİLEK","KARAPINAR ANADOLU İMAM HATİP LİSESİ",20,20,20,20,20,20,6,{"$error":"#DIV/0!"}]
[7,"MEHMET AKİF KABUKÇU","AFYONKARAHİSAR ANADOLU İMAM HATİP LİSESİ",15,15,15,15,15,15,7,{"$error":"#DIV/0!"}]
[8,"ONUR ÜNLÜ","ANTALYA ANADOLU İMAM HATİP LİSESİ",10,10,10,10,10,10,8,{"$error":"#DIV/0!"}]
[9,"ALİ CESUR","TEFENNİ ANADOLU İMAM HATİP LİSESİ",5,5,5,5,5,5,9]
[10,"KAMİL YEŞİL","KONYA ANADOLU İMAM HATİP LİSESİ",1,1,1,1,1,1,10]
[11]
[12]
[13]
[14]
[15]
[16]
[17]
[18]
[19]
[20]
[20]
[]
[{"$f":"TODAY()","v":"2023-04-19"},null,null,null,null,null,null,null,null,null,{"$f":"SUM(D27:H27)","v":0}]
[null,null,null,null,null,null,null,null,null,null,0]
[{"$f":"DATA!D7","v":"YUSUF ARIKAN"},null,{"$f":"DATA!F7","v":"ALİ ÖGE"},{"$f":"DATA!G7","v":"MUSTAFA YILDIRIM"},null,{"$f":"DATA!H7","v":"MEHMET CABA"},null,{"$f":"DATA!I7","v":"ÜNVER GÜNGÖR"},null,null,0]
[{"$f":"DATA!E7","v":"İl Müftü Yardımcısı"},null,"Seçici Kurul Üyesi","Seçici Kurul Üyesi",null,"Seçici Kurul Üyesi",null,null,"Seçici Kurul Üyesi",null,0]
[null,null,null,null,null,null,null,null,null,null,0]
[]
[null,null,null,null,null,null,null,null,null,null,{"$f":"SUM(D33:H33)","v":0}]
[]
[null,null,null,null,null,null,null,null,null,null,null,null,null,null,null,null,null,null,null,null,null,null,""]
[null,null,null,null,null,null,null,null,null,null,null,null,null,null,null,null,null,null,null,null,null,null,""]
[null,null,null,null,null,null,null,null,null,null,null,null,null,null,null,null,null,null,null,null,null,null,""]
[null,null,null,null,null,null,null,null,null,null,null,null,null,null,null,null,null,null,null,null,null,null,""]
[null,null,null,null,null,null,null,null,null,null,null,null,null,null,null,null,null,null,null,null,null,null,""]
[null,null,null,null,null,null,null,null,null,null,null,null,null,null,null,null,null,null,null,null,null,null,""]
{"$rows_left_out":4}
{"sheet":"KURA","index":4,"n_rows":110,"n_cols":16,"rows_kept":110,"cut":false,"hidden":false,"merged":[[38,0,38,3],[38,5,38,8],[38,10,38,13],[38,15,38,18],[50,0,50,18],[52,0,52,18],[61,0,61,10],[23,1,23,6],[23,8,23,12],[23,14,23,18],[24,1,24,6],[24,8,24,12],[24,14,24,18],[61,13,61,18],[54,0,54,18],[56,0,56,18],[58,0,58,18],[51,0,51,10],[53,0,53,10],[60,0,60,18],[39,15,39,18],[43,0,43,3],[43,15,43,18],[43,10,43,13],[12,1,12,9],[13,1,13,9],[14,1,14,9],[10,10,10,12],[11,10,11,12],[12,10,12,12],[13,10,13,12],[14,10,14,12],[34,15,34,18],[28,1,28,6],[28,8,28,12],[28,14,28,18],[29,1,29,6],[29,8,29,12],[29,14,29,18],[0,0,1,18],[3,1,5,17],[6,1,7,17],[47,0,47,10],[34,0,34,3],[34,5,34,8],[34,10,34,13],[33,0,33,3],[33,5,33,8],[33,10,33,13],[33,15,33,18],[15,10,15,12],[16,10,16,12],[17,10,17,12],[18,10,18,12],[19,10,19,12],[19,1,19,9],[9,1,9,9],[15,1,15,9],[16,1,16,9],[17,1,17,9],[18,1,18,9],[10,1,10,9],[11,1,11,9],[39,0,39,3],[39,5,39,8],[39,10,39,13],[63,0,63,10],[55,0,55,10],[49,0,49,10],[48,0,48,18],[57,0,57,10],[59,0,59,10],[63,13,63,18],[62,0,62,18],[44,0,44,3],[44,15,44,18],[44,10,44,13],[69,0,69,10],[69,13,69,18],[70,0,70,18],[71,0,71,10],[71,13,71,18],[72,0,72,18],[67,0,67,18],[65,0,65,10],[47,13,47,18],[49,13,49,18],[51,13,51,18],[53,13,53,18],[55,13,55,18],[57,13,57,18],[59,13,59,18],[65,13,65,18],[64,0,64,18],[66,0,66,18],[73,0,73,10],[73,13,73,18],[74,0,74,18],[75,0,75,10],[75,13,75,18],[76,0,76,18],[77,0,77,10],[77,13,77,18],[78,0,78,18],[89,0,89,18],[85,0,85,10],[85,13,85,18],[86,0,86,18],[87,0,87,10],[87,13,87,18],[88,0,88,18],[79,0,79,10],[79,13,79,18],[80,0,80,18],[81,0,81,10],[81,13,81,18],[82,0,82,18],[83,0,83,10],[83,13,83,18],[84,0,84,18],[101,0,101,10],[101,13,101,18],[102,0,102,18],[91,0,91,10],[91,13,91,18],[92,0,92,18],[93,0,93,10],[93,13,93,18],[94,0,94,18],[95,0,95,10],[95,13,95,18],[96,0,96,18],[97,0,97,10],[97,13,97,18],[98,0,98,18],[99,0,99,10],[99,13,99,18],[100,0,100,18],[109,0,109,10],[109,13,109,18],[110,0,110,18],[103,0,103,10],[103,13,103,18],[104,0,104,18],[105,0,105,10],[105,13,105,18],[106,0,106,18],[107,0,107,10],[107,13,107,18],[108,0,108,18]]}
[{"$f":"DATA!F2&\" \"&DATA!C2 & \" Kura Tutanağı\"","v":"Din Öğretimi Genel Müdürlüğü 2023 \"GENÇ BİLÂLLER\" EZAN OKUMA YARIŞMASI Kura Tutanağı"}]
[]
[]
[null,"\"Genç Bilâller\" Ezan Okuma Yarışması 7. bölge finali için Konya Anadolu İmam Hatip Lisesinin koordinesinde  Konya Mevlana Kültür Merkezi Sultan Veled Salonunda  16.04.2016 Cumartesi günü çekilen  kura sonucunda öğrencilerinezan okuma yarışma sırası aşağıdaki gibi gerçekleşmiştir. "]
[]
[]
[null,"       Bu tutanak tarafımızdan hazırlanarak imza altına alınmıştır. 16.04.2016"]
[]
[]
["S.N.","YARIŞMACI ÖĞRENCİNİN ADI SOYADI",null,null,null,null,null,null,null,null,null,"KUR'A SONUCU"]
[1,{"$f":"DATA!B7","v":"KAMİL YEŞİL"},"Ahmet GÖÇMENOĞLU","Ahmet GÖÇMENOĞLU","Ahmet GÖÇMENOĞLU","Ahmet GÖÇMENOĞLU","Ahmet GÖÇMENOĞLU","Ahmet GÖÇMENOĞLU","Ahmet GÖÇMENOĞLU","Ahmet GÖÇMENOĞLU",{"$f":"DATA!A7","v":1}]
[2,{"$f":"DATA!B8","v":"RAMAZAN KAYMAK"},"Ahmet GÖÇMENOĞLU","Ahmet GÖÇMENOĞLU","Ahmet GÖÇMENOĞLU","Ahmet GÖÇMENOĞLU","Ahmet GÖÇMENOĞLU","Ahmet GÖÇMENOĞLU","Ahmet GÖÇMENOĞLU","Ahmet GÖÇMENOĞLU",{"$f":"DATA!A8","v":7}]
[3,{"$f":"DATA!B9","v":"İBRAHİM KARAYER"},"Ahmet GÖÇMENOĞLU","Ahmet GÖÇMENOĞLU","Ahmet GÖÇMENOĞLU","Ahmet GÖÇMENOĞLU","Ahmet GÖÇMENOĞLU","Ahmet GÖÇMENOĞLU","Ahmet GÖÇMENOĞLU","Ahmet GÖÇMENOĞLU",{"$f":"DATA!A9","v":6}]
[4,{"$f":"DATA!B10","v":"MUHAMMET DİLEK"},"Ahmet GÖÇMENOĞLU","Ahmet GÖÇMENOĞLU","Ahmet GÖÇMENOĞLU","Ahmet GÖÇMENOĞLU","Ahmet GÖÇMENOĞLU","Ahmet GÖÇMENOĞLU","Ahmet GÖÇMENOĞLU","Ahmet GÖÇMENOĞLU",{"$f":"DATA!A10","v":5}]
[5,{"$f":"DATA!B11","v":"MEHMET AKİF KABUKÇU"},"Ahmet GÖÇMENOĞLU","Ahmet GÖÇMENOĞLU","Ahmet GÖÇMENOĞLU","Ahmet GÖÇMENOĞLU","Ahmet GÖÇMENOĞLU","Ahmet GÖÇMENOĞLU","Ahmet GÖÇMENOĞLU","Ahmet GÖÇMENOĞLU",{"$f":"DATA!A11","v":4}]
[6,{"$f":"DATA!B12","v":"ONUR ÜNLÜ"},"Ahmet GÖÇMENOĞLU","Ahmet GÖÇMENOĞLU","Ahmet GÖÇMENOĞLU","Ahmet GÖÇMENOĞLU","Ahmet GÖÇMENOĞLU","Ahmet GÖÇMENOĞLU","Ahmet GÖÇMENOĞLU","Ahmet GÖÇMENOĞLU",{"$f":"DATA!A12","v":3}]
[7,{"$f":"DATA!B13","v":"ALİ CESUR"},"Ahmet GÖÇMENOĞLU","Ahmet GÖÇMENOĞLU","Ahmet GÖÇMENOĞLU","Ahmet GÖÇMENOĞLU","Ahmet GÖÇMENOĞLU","Ahmet GÖÇMENOĞLU","Ahmet GÖÇMENOĞLU","Ahmet GÖÇMENOĞLU",{"$f":"DATA!A13","v":2}]
[8,{"$f":"DATA!B14","v":"KADİR ÜNLÜSOY"},"Ahmet GÖÇMENOĞLU","Ahmet GÖÇMENOĞLU","Ahmet GÖÇMENOĞLU","Ahmet GÖÇMENOĞLU","Ahmet GÖÇMENOĞLU","Ahmet GÖÇMENOĞLU","Ahmet GÖÇMENOĞLU","Ahmet GÖÇMENOĞLU",{"$f":"DATA!A14","v":8}]
[9,{"$f":"DATA!B15","v":"MUHAMMET ERKAL"},"Ahmet GÖÇMENOĞLU","Ahmet GÖÇMENOĞLU","Ahmet GÖÇMENOĞLU","Ahmet GÖÇMENOĞLU","Ahmet GÖÇMENOĞLU","Ahmet GÖÇMENOĞLU","Ahmet GÖÇMENOĞLU","Ahmet GÖÇMENOĞLU",{"$f":"DATA!A15","v":9}]
[10,{"$f":"DATA!B16","v":"ONUR YÜCESAN"},"Ahmet GÖÇMENOĞLU","Ahmet GÖÇMENOĞLU","Ahmet GÖÇMENOĞLU","Ahmet GÖÇMENOĞLU","Ahmet GÖÇMENOĞLU","Ahmet GÖÇMENOĞLU","Ahmet GÖÇMENOĞLU","Ahmet GÖÇMENOĞLU",{"$f":"DATA!A16","v":10}]
[]
[]
[]
[null,{"$f":"DATA!D7","v":"YUSUF ARIKAN"},null,null,null,null,null,null,{"$f":"DATA!F7","v":"ALİ ÖGE"},null,null,null,null,null,{"$f":"DATA!G7","v":"MUSTAFA YILDIRIM"}]
[null,{"$f":"DATA!E7","v":"İl Müftü Yardımcısı"},null,null,null,null,null,null,"Seçici Kurul Üyesi",null,null,null,null,null,"Seçici Kurul Üyesi"]
[]
[]
[]
[null,{"$f":"DATA!H7","v":"MEHMET CABA"},null,null,null,null,null,null,null,null,null,null,null,null,{"$f":"DATA!I7","v":"ÜNVER GÜNGÖR"}]
[null,"Seçici Kurul Üyesi",null,null,null,null,null,null,null,null,null,null,null,null,"Seçici Kurul Üyesi"]
[]
[]
[]
[{"$f":"DATA!J7","v":"MUSTAFA EKİNCİ"},null,null,null,null,{"$f":"DATA!J8","v":"MEHMET AKİF EKİNCİ"},null,null,null,null,{"$f":"DATA!J9","v":"ZEYNEP ARSLANTALAY"},null,null,null,null,{"$f":"DATA!J10","v":"MUSTAFA SARIBAŞ"}]
[{"$f":"DATA!C7","v":"KONYA ANADOLU İMAM HATİP LİSESİ"},null,null,null,null,{"$f":"DATA!C8","v":"AKŞEHİR ANADOLU İMAM HATİP LİSESİ"},null,null,null,null,{"$f":"DATA!C9","v":"ALTINEKİN ANADOLU İMAM HATİP LİSESİ"},null,null,null,null,{"$f":"DATA!C10","v":"KARAPINAR ANADOLU İMAM HATİP LİSESİ"}]
[]
[]
[]
[{"$f":"DATA!J11","v":"EROL ADA"},null,null,null,null,{"$f":"DATA!J12","v":"İBRAHİM AKTAN"},null,null,null,null,{"$f":"DATA!J13","v":"MEHMET BÖYÜK"},null,null,null,null,{"$f":"DATA!J14","v":"HÜSEYİN YÜREKLİ"}]
[{"$f":"DATA!C11","v":"AFYONKARAHİSAR ANADOLU İMAM HATİP LİSESİ"},null,null,null,null,{"$f":"DATA!C12","v":"ANTALYA ANADOLU İMAM HATİP LİSESİ"},null,null,null,null,{"$f":"DATA!C13","v":"TEFENNİ ANADOLU İMAM HATİP LİSESİ"},null,null,null,null,{"$f":"DATA!C14","v":"ATABEY MEHMET YILDIZLI ANADOLU İMAM HATİP LİSESİ"}]
{"$rows_left_out":71}
{"sheet":"EK-16","index":5,"n_rows":85,"n_cols":12,"rows_kept":85,"cut":false,"hidden":false,"merged":[[24,1,24,5],[41,1,41,5],[58,1,58,5],[75,1,75,5],[71,1,71,5],[72,1,72,5],[73,1,73,5],[32,4,32,7],[49,4,49,7],[61,0,61,2],[61,3,61,5],[61,6,61,7],[66,4,66,7],[67,4,67,6],[64,4,64,7],[65,4,65,7],[68,0,68,7],[69,0,69,7],[70,0,70,7],[59,0,59,5],[60,0,60,2],[60,3,60,5],[60,6,60,7],[56,1,56,5],[57,1,57,5],[47,4,47,7],[48,4,48,7],[50,4,50,6],[51,0,51,7],[52,0,52,7],[53,0,53,7],[34,0,34,7],[35,0,35,7],[36,0,36,7],[54,1,54,5],[55,1,55,5],[42,0,42,5],[37,1,37,5],[43,0,43,2],[43,3,43,5],[38,1,38,5],[39,1,39,5],[44,0,44,2],[44,3,44,5],[44,6,44,7],[5,1,5,5],[6,1,6,5],[9,6,9,7],[10,0,10,2],[10,3,10,5],[10,6,10,7],[9,0,9,2],[9,3,9,5],[8,0,8,5],[7,1,7,5],[13,4,13,7],[14,4,14,7],[40,1,40,5],[0,0,0,7],[1,0,1,7],[2,0,2,7],[3,1,3,5],[4,1,4,5],[15,4,15,7],[17,0,17,7],[16,4,16,6],[33,4,33,6],[18,0,18,7],[19,0,19,7],[20,1,20,5],[21,1,21,5],[22,1,22,5],[23,1,23,5],[25,0,25,5],[26,0,26,2],[26,3,26,5],[26,6,26,7],[27,0,27,2],[27,3,27,5],[27,6,27,7],[30,4,30,7],[31,4,31,7],[84,4,84,6],[74,1,74,5],[76,0,76,5],[77,0,77,2],[77,3,77,5],[77,6,77,7],[83,4,83,7],[78,0,78,2],[78,3,78,5],[78,6,78,7],[81,4,81,7],[82,4,82,7],[43,6,43,7]]}
["Ek-16"]
[{"$f":"DATA!C2","v":"2023 \"GENÇ BİLÂLLER\" EZAN OKUMA YARIŞMASI"}]
["Seçici Kurul Değerlendirme Formu"]
["S.No","Ölçüt",null,null,null,null,"Puan Değeri","Verilen Puan"]
[1,{"$f":"DATA!D3","v":"TABAN PUAN"},null,null,null,null,{"$f":"DATA!F3","v":30},null,null,null,null,10]
[2,{"$f":"DATA!A4","v":"MAKAM"},null,null,null,null,{"$f":"DATA!C4","v":3}]
[3,{"$f":"DATA!D4","v":"SES ve SEDA"},null,null,null,null,{"$f":"DATA!E4","v":20}]
[4,{"$f":"DATA!F4","v":"DİKSİYON VE TECVİT"},null,null,null,null,{"$f":"DATA!G4","v":20}]
["Toplam",null,null,null,null,null,100]
["Yarışmacının  Adı Soyadı",null,null,"Okulu",null,null,"Aldığı Toplam Puan"]
[{"$f":"VLOOKUP(L5,DATA!A:BF,2,FALSE)","v":"ONUR YÜCESAN"},null,null,{"$f":"VLOOKUP(L5,DATA!A:BI,3,FALSE)","v":"MUCUR ANADOLU İMAM HATİP LİSESİ"}]
[]
[]
[null,null,null,null,{"$f":"VLOOKUP(L5,DATA!A:BI,4,FALSE)","v":"YUSUF ARIKAN"}]
[null,null,null,null,{"$f":"VLOOKUP(L5,DATA!A:BI,5,FALSE)","v":"İl Müftü Yardımcısı"}]
[null,null,null,null,"Seçici Kurul Üyesi"]
[null,null,null,null,null,null,null,1]
["Ek-16"]
[{"$f":"A2","v":"2023 \"GENÇ BİLÂLLER\" EZAN OKUMA YARIŞMASI"}]
["Seçici Kurul Değerlendirme Formu"]
["S.No","Ölçüt",null,null,null,null,"Puan Değeri","Verilen Puan"]
[1,{"$f":"B5","v":"TABAN PUAN"},null,null,null,null,{"$f":"G5","v":30},null,null,null,null,{"$f":"L5","v":10}]
[2,{"$f":"B6","v":"MAKAM"},null,null,null,null,{"$f":"G6","v":3}]
[3,{"$f":"B7","v":"SES ve SEDA"},null,null,null,null,{"$f":"G7","v":20}]
[4,{"$f":"B8","v":"DİKSİYON VE TECVİT"},null,null,null,null,{"$f":"G8","v":20}]
["Toplam",null,null,null,null,null,100]
["Yarışmacının  Adı Soyadı",null,null,"Okulu",null,null,"Aldığı Toplam Puan"]
[{"$f":"VLOOKUP(L22,DATA!A:BF,2,FALSE)","v":"ONUR YÜCESAN"},null,null,{"$f":"VLOOKUP(L22,DATA!A:BI,3,FALSE)","v":"MUCUR ANADOLU İMAM HATİP LİSESİ"}]
[]
[]
[null,null,null,null,{"$f":"VLOOKUP(L22,DATA!A:BI,6,FALSE)","v":"ALİ ÖGE"}]
[null,null,null,null,"Seçici Kurul Üyesi"]
[]
[null,null,null,null,null,null,null,2]
["Ek-16"]
[{"$f":"A19","v":"2023 \"GENÇ BİLÂLLER\" EZAN OKUMA YARIŞMASI"}]
["Seçici Kurul Değerlendirme Formu"]
["S.No","Ölçüt",null,null,null,null,"Puan Değeri","Verilen Puan"]
[1,{"$f":"B22","v":"TABAN PUAN"},null,null,null,null,{"$f":"G22","v":30},null,null,null,null,{"$f":"L5","v":10}]
[2,{"$f":"B23","v":"MAKAM"},null,null,null,null,{"$f":"G23","v":3}]
{"$rows_left_out":46}
{"sheet":"EK-17","index":6,"n_rows":17,"n_cols":7,"rows_kept":17,"cut":false,"hidden":false,"merged":[[0,0,0,3],[1,0,1,3],[2,0,2,3],[3,0,3,3],[4,0,5,0],[4,2,4,3],[5,2,5,3],[16,0,16,2],[6,0,7,0],[6,2,6,3],[7,2,7,3],[8,0,8,3],[9,1,9,2],[10,1,10,2],[11,1,11,2],[12,1,12,2],[13,1,13,2],[14,1,14,2],[15,0,15,2]]}
["Ek-17"]
[{"$f":"DATA!C2","v":"2023 \"GENÇ BİLÂLLER\" EZAN OKUMA YARIŞMASI"}]
["Seçici Kurul Toplam Puanlama Formu"]
["A) Yarışma Bilgileri"]
["Yarışmacının","Adı Soyadı",{"$f":"VLOOKUP('EK-17'!G6,İCMAL!A:J,2,FALSE)","v":"ONUR YÜCESAN"}]
[null,"Okulu",{"$f":"VLOOKUP('EK-17'!G6,İCMAL!A:J,3,FALSE)","v":"MUCUR ANADOLU İMAM HATİP LİSESİ"},null,null,null,10]
["Yarışmanın","Yapıldığı yer                        (Cami/Salon)","Konya  / Karatay Kadı İzzettin Camii"]
[null,"Yapıldığı kategori                                                          (Okul, İlçe, İl içi bölge, il ve bölge)",{"$f":"DATA!C3","v":"7. BÖLGE"}]
["B) Seçici Kurul Yarışmacı Değerlendirme Formu"]
["S.No","Seçici Kurul Üyesinin Adı Soyadı",null,"Verdiği Puan"]
[1,{"$f":"DATA!D7","v":"YUSUF ARIKAN"},null,{"$f":"VLOOKUP(G6,İCMAL!A:J,4,FALSE)","v":25}]
[2,{"$f":"DATA!F7","v":"ALİ ÖGE"},null,{"$f":"VLOOKUP(G6,İCMAL!A:J,5,FALSE)","v":52}]
[3,{"$f":"DATA!G7","v":"MUSTAFA YILDIRIM"},null,{"$f":"VLOOKUP(G6,İCMAL!A:J,6,FALSE)","v":456}]
[4,{"$f":"DATA!H7","v":"MEHMET CABA"},null,{"$f":"VLOOKUP(G6,İCMAL!A:J,7,FALSE)","v":145}]
[5,{"$f":"DATA!I7","v":"ÜNVER GÜNGÖR"},null,{"$f":"VLOOKUP(G6,İCMAL!A:J,8,FALSE)","v":156}]
["Seçici kurul üyelerinin verdikleri puanların toplamı",null,null,{"$f":"VLOOKUP(G6,İCMAL!A:L,11,FALSE)","v":834}]
["Toplam aritmetik puan",null,null,{"$f":"VLOOKUP(G6,İCMAL!A:L,9,FALSE)","v":166.8}]

{"sheet":"BOŞ LİSTE","index":7,"n_rows":32,"n_cols":11,"rows_kept":32,"cut":false,"hidden":false,"merged":[[31,4,31,7],[27,0,27,1],[29,0,29,1],[29,3,29,4],[29,5,29,6],[29,7,29,9],[30,0,30,1],[30,3,30,4],[30,6,30,7],[0,0,0,2],[1,0,2,9],[26,0,26,1],[26,3,26,4],[26,5,26,6],[26,7,26,9]]}
[{"$f":"DATA!C3","v":"7. BÖLGE"}]
[{"$f":"DATA!F2&\" \"&DATA!C2 & \" Değerlendirme Formu\"","v":"Din Öğretimi Genel Müdürlüğü 2023 \"GENÇ BİLÂLLER\" EZAN OKUMA YARIŞMASI Değerlendirme Formu"}]
[]
["S.N.","Öğrencinin Adı Soyadı","İl/İlçe/Okul",{"$f":"DATA!D7","v":"YUSUF ARIKAN"},{"$f":"DATA!F7","v":"ALİ ÖGE"},{"$f":"DATA!G7","v":"MUSTAFA YILDIRIM"},{"$f":"DATA!H7","v":"MEHMET CABA"},{"$f":"DATA!I7","v":"ÜNVER GÜNGÖR"},"Aritmetik Ortalaması ","Sıralama"]
[1,{"$f":"DATA!B7","v":"KAMİL YEŞİL"},null,null,null,null,null,null,null,null,{"$f":"SUM(D5:H5)","v":0}]
[2,{"$f":"DATA!B8","v":"RAMAZAN KAYMAK"},null,null,null,null,null,null,null,null,{"$f":"SUM(D6:H6)","v":0}]
[3,{"$f":"DATA!B9","v":"İBRAHİM KARAYER"},null,null,null,null,null,null,null,null,0]
[4,{"$f":"DATA!B10","v":"MUHAMMET DİLEK"},null,null,null,null,null,null,null,null,0]
[5,{"$f":"DATA!B11","v":"MEHMET AKİF KABUKÇU"},null,null,null,null,null,null,null,null,0]
[6,{"$f":"DATA!B12","v":"ONUR ÜNLÜ"},null,null,null,null,null,null,null,null,0]
[7,{"$f":"DATA!B13","v":"ALİ CESUR"},null,null,null,null,null,null,null,null,0]
[8,{"$f":"DATA!B14","v":"KADİR ÜNLÜSOY"},null,null,null,null,null,null,null,null,0]
[9,{"$f":"DATA!B15","v":"MUHAMMET ERKAL"},null,null,null,null,null,null,null,null,0]
[10,{"$f":"DATA!B16","v":"ONUR YÜCESAN"},null,null,null,null,null,null,null,null,0]
[11,{"$f":"DATA!B17","v":0},null,null,null,null,null,null,null,null,0]
[12,{"$f":"DATA!B18","v":0},null,null,null,null,null,null,null,null,0]
[13,{"$f":"DATA!B19","v":0},null,null,null,null,null,null,null,null,0]
[14,{"$f":"DATA!B20","v":0},null,null,null,null,null,null,null,null,0]
[15,{"$f":"DATA!B21","v":0},null,null,null,null,null,null,null,null,0]
[16,null,null,null,null,null,null,null,null,null,0]
[17,null,null,null,null,null,null,null,null,{"$f":"IF(I21=\"\",\"\",(RANK(I21,I$5:I$24)))","v":""},0]
[18,null,null,null,null,null,null,null,null,"",0]
[19,null,null,null,null,null,null,null,null,"",0]
[null,null,null,null,null,null,null,null,null,"",0]
[null,null,null,null,null,null,null,null,null,null,0]
[null,null,null,null,null,null,null,null,null,null,0]
["KOMİSYON BAŞKANI",null,"ÜYE-1","ÜYE-2",null,"ÜYE-3",null,"ÜYE-4",null,null,0]
[{"$f":"TODAY()","v":"2023-04-19"},null,null,null,null,null,null,null,null,null,0]
[null,null,null,null,null,null,null,null,null,null,0]
[{"$f":"DATA!D7","v":"YUSUF ARIKAN"},null,{"$f":"DATA!F7","v":"ALİ ÖGE"},{"$f":"DATA!G7","v":"MUSTAFA YILDIRIM"},null,{"$f":"DATA!H7","v":"MEHMET CABA"},null,{"$f":"DATA!I7","v":"ÜNVER GÜNGÖR"},null,null,0]
[{"$f":"DATA!E7","v":"İl Müftü Yardımcısı"},null,null,null,null,null,null,null,null,null,0]
[null,null,null,null,null,null,null,null,null,null,0]